Target
P2Y purinoceptor 12
Ligand
BDBM50302629
Substrate
Meas. Tech.
ChEMBL_595036 (CHEMBL1042521)
Ki
1.5±n/a nM
Citation
 Parlow, JJBurney, MWCase, BLGirard, TJHall, KAHiebsch, RRHuff, RMLachance, RMMischke, DARapp, SRWoerndle, RSEnnis, MD Piperazinyl-glutamate-pyrimidines as potent P2Y12 antagonists for inhibition of platelet aggregation. Bioorg Med Chem Lett 19:6148-56 (2009)  
Target
Name:
P2Y purinoceptor 12
Synonyms:
ADP-glucose receptor HORK3 P2T(AC) P2Y(AC) P2Y(cyc) P2Y12 platelet ADP receptor Purinergic receptor P2Y12 | SP1999
Type:
Enzyme
Mol. Mass.:
39458.48
Organism:
Homo sapiens (Human)
Description:
Q9H244
Residue:
342
  
Inhibitor
Name:
BDBM50302629
Synonyms:
(S)-5-oxo-5-(4-(pentyloxycarbonyl)piperazin-1-yl)-4-(2-phenyl-6-(4-(pyrrolidin-1-yl)piperidin-1-yl)pyrimidine-4-carboxamido)pentanoic acid | CHEMBL570152
Type:
Small organic molecule
Emp. Form.:
C35H49N7O6
Mol. Mass.:
663.8069
SMILES:
CCCCCOC(=O)N1CCN(CC1)C(=O)[C@H](CCC(O)=O)NC(=O)c1cc(nc(n1)-c1ccccc1)N1CCC(CC1)N1CCCC1
: