Target
Mu-type opioid receptor
Ligand
BDBM50302759
Substrate
Meas. Tech.
ChEMBL_595267 (CHEMBL1043619)
Ki
127±n/a nM
Citation
 Jones, PGriffin, AMGawell, LLavoie, RDelorme, DRoberts, EBrown, WWalpole, CXiao, WBoulet, JLabarre, MCoupal, MButterworth, JSt-Onge, SHodzic, LSalois, D N,N-Diethyl-4-[(3-hydroxyphenyl)(piperidin-4-yl)amino] benzamide derivatives: the development of diaryl amino piperidines as potent delta opioid receptor agonists with in vivo anti-nociceptive activity in rodent models. Bioorg Med Chem Lett 19:5994-8 (2009)  
Target
Name:
Mu-type opioid receptor
Synonyms:
M-OR-1 MOR-1 MUOR1 Mu opiate receptor OPRM1 hMOP | mu-type opioid receptor isoform MOR-1
Type:
G Protein-Coupled Receptor (GPCR)
Mol. Mass.:
44789.51
Organism:
Homo sapiens (Human)
Description:
P35372
Residue:
400
  
Inhibitor
Name:
BDBM50302759
Synonyms:
CHEMBL584941 | N,N-diethyl-4-((3-hydroxyphenyl)(1-(2-(thiophen-3-yl)ethyl)piperidin-4-yl)amino)benzamide
Type:
Small organic molecule
Emp. Form.:
C28H35N3O2S
Mol. Mass.:
477.661
SMILES:
CCN(CC)C(=O)c1ccc(cc1)N(C1CCN(CCc2ccsc2)CC1)c1cccc(O)c1
: