Target
Kappa-type opioid receptor
Ligand
BDBM50302768
Substrate
Meas. Tech.
ChEMBL_595268 (CHEMBL1043620)
Ki
98±n/a nM
Citation
 Jones, PGriffin, AMGawell, LLavoie, RDelorme, DRoberts, EBrown, WWalpole, CXiao, WBoulet, JLabarre, MCoupal, MButterworth, JSt-Onge, SHodzic, LSalois, D N,N-Diethyl-4-[(3-hydroxyphenyl)(piperidin-4-yl)amino] benzamide derivatives: the development of diaryl amino piperidines as potent delta opioid receptor agonists with in vivo anti-nociceptive activity in rodent models. Bioorg Med Chem Lett 19:5994-8 (2009)  
Target
Name:
Kappa-type opioid receptor
Synonyms:
K-OR-1 Kappa-opioid receptor (KOR) Kappa-type opioid receptor (KOR) OPIATE Kappa OPRK1 kappa opioid receptor (KOR)
Type:
G Protein-Coupled Receptor (GPCR)
Mol. Mass.:
42648.76
Organism:
Homo sapiens (Human)
Description:
P41145
Residue:
380
  
Inhibitor
Name:
BDBM50302768
Synonyms:
4-((1-(but-3-enyl)piperidin-4-yl)(3-hydroxyphenyl)amino)-N,N-diethylbenzamide | CHEMBL570232
Type:
Small organic molecule
Emp. Form.:
C26H35N3O2
Mol. Mass.:
421.575
SMILES:
CCN(CC)C(=O)c1ccc(cc1)N(C1CCN(CCC=C)CC1)c1cccc(O)c1
: