Target
Signal transducer and activator of transcription 5B
Ligand
BDBM50303041
Substrate
Meas. Tech.
ChEMBL_597270 (CHEMBL1043447)
EC50
40±n/a nM
Citation
 Ioannidis, SLamb, MLDavies, AMAlmeida, LSu, MBebernitz, GYe, MBell, KAlimzhanov, MZinda, M Discovery of pyrazol-3-ylamino pyrazines as novel JAK2 inhibitors. Bioorg Med Chem Lett 19:6524-8 (2009)  
Target
Name:
Signal transducer and activator of transcription 5B
Synonyms:
STA5B_HUMAN Signal transducer and activator of transcription 5B | Transcription factor STAT5b (STAT5b)
Type:
Protein
Mol. Mass.:
89858.26
Organism:
Homo sapiens (Human)
Description:
Residue:
787
  
Inhibitor
Name:
BDBM50303041
Synonyms:
(S)-3-(1-(5-fluoropyrimidin-2-yl)ethylamino)-5-(5-methyl-1H-pyrazol-3-ylamino)pyrazine-2-carbonitrile | CHEMBL570002
Type:
Small organic molecule
Emp. Form.:
C15H14FN9
Mol. Mass.:
339.3304
SMILES:
C[C@H](Nc1nc(Nc2cc(C)n[nH]2)cnc1C#N)c1ncc(F)cn1
: