Target
Serine/threonine-protein kinase B-raf
Ligand
BDBM50303103
Substrate
Meas. Tech.
ChEMBL_597720 (CHEMBL1043507)
IC50
0.3±n/a nM
Citation
 Di Grandi, MJBerger, DMHopper, DWZhang, CDutia, MDunnick, ALTorres, NLevin, JIDiamantidis, GZapf, CWBloom, JDHu, YPowell, DWojciechowicz, DCollins, KFrommer, E Novel pyrazolopyrimidines as highly potent B-Raf inhibitors. Bioorg Med Chem Lett 19:6957-61 (2009)  
Target
Name:
Serine/threonine-protein kinase B-raf
Synonyms:
B-RAF B-Raf proto-oncogene serine/threonine-protein kinase BRAF1 RAFB1 v-Raf murine sarcoma viral oncogene homolog B1
Type:
Serine/threonine-protein kinase
Mol. Mass.:
84446.00
Organism:
Homo sapiens (Human)
Description:
P15056
Residue:
766
  
Inhibitor
Name:
BDBM50303103
Synonyms:
1-(3-(3-(4-chloro-3-hydroxyphenyl)-2-(pyridin-4-yl)-1,2-dihydropyrazolo[1,5-a]pyrimidin-7-yl)-8-azabicyclo[3.2.1]octan-8-yl)ethanone | CHEMBL578391
Type:
Small organic molecule
Emp. Form.:
C26H24ClN5O2
Mol. Mass.:
473.954
SMILES:
CC(=O)N1C2CCC1CC(C2)c1ccnc2c(c(nn12)-c1ccncc1)-c1ccc(Cl)c(O)c1
: