Target
5-hydroxytryptamine receptor 6
Ligand
BDBM50303163
Substrate
Meas. Tech.
ChEMBL_594896 (CHEMBL1038947)
Ki
3.9±n/a nM
Citation
 Bernotas, RCAntane, SALenicek, SEHaydar, SNRobichaud, AJHarrison, BLZhang, GMSmith, DCoupet, JSchechter, LE 1-(2-Aminoethyl)-3-(arylsulfonyl)-1H-pyrrolopyridines are 5-HT(6) receptor ligands. Bioorg Med Chem Lett 19:6935-8 (2009)  
Target
Name:
5-hydroxytryptamine receptor 6
Synonyms:
5-HT-6 5-hydroxytryptamine receptor 6 (5-HT-6) 5-hydroxytryptamine receptor 6 (5HT6) HTR6 Serotonin 6 (5-HT6) receptor | Serotonin Receptor 6
Type:
G Protein-Coupled Receptor (GPCR)
Mol. Mass.:
46968.43
Organism:
Homo sapiens (Human)
Description:
P50406
Residue:
440
  
Inhibitor
Name:
BDBM50303163
Synonyms:
1-(3-(4-bromophenylsulfonyl)-1-(2-(dimethylamino)ethyl)-1H-pyrrolo[3,2-b]pyridin-5-yl)ethanone | CHEMBL572092
Type:
Small organic molecule
Emp. Form.:
C19H20BrN3O3S
Mol. Mass.:
450.349
SMILES:
CN(C)CCn1cc(c2nc(ccc12)C(C)=O)S(=O)(=O)c1ccc(Br)cc1
: