Target
Neprilysin
Ligand
BDBM50084893
Substrate
Meas. Tech.
ChEMBL_595725 (CHEMBL1045248)
IC50
2300±n/a nM
Citation
 Jullien, NMakritis, AGeorgiadis, DBeau, FYiotakis, ADive, V Phosphinic tripeptides as dual angiotensin-converting enzyme C-domain and endothelin-converting enzyme-1 inhibitors. J Med Chem 53:208-20 (2010)  
Target
Name:
Neprilysin
Synonyms:
Atriopeptidase CD_antigen=CD10 EPN MME NEP_HUMAN Neutral endopeptidase | Neutral endopeptidase 24.11
Type:
Enzyme
Mol. Mass.:
85505.38
Organism:
Homo sapiens (Human)
Description:
P08473
Residue:
750
  
Inhibitor
Name:
BDBM50084893
Synonyms:
(S)-3-(dibenzo[b,d]furan-3-yl)-2-(phosphonomethylamino)propanoic acid CHEMBL146936
Type:
Small organic molecule
Emp. Form.:
C16H16NO6P
Mol. Mass.:
349.2751
SMILES:
OC(=O)[C@H](Cc1ccc2c(c1)oc1ccccc21)NCP(O)(O)=O
: