Target
Angiotensin-converting enzyme
Ligand
BDBM50303331
Substrate
Meas. Tech.
ChEMBL_595724 (CHEMBL1045247)
Ki
20±n/a nM
Citation
 Jullien, NMakritis, AGeorgiadis, DBeau, FYiotakis, ADive, V Phosphinic tripeptides as dual angiotensin-converting enzyme C-domain and endothelin-converting enzyme-1 inhibitors. J Med Chem 53:208-20 (2010)  
Target
Name:
Angiotensin-converting enzyme
Synonyms:
ACE Angiotensin converting enzyme (ACE) Angiotensin-converting enzyme, soluble form CD_antigen=CD143 DCP1 Kininase II
Type:
Enzyme
Mol. Mass.:
149709.01
Organism:
Homo sapiens (Human)
Description:
Residue:
1306
  
Inhibitor
Name:
BDBM50303331
Synonyms:
(2S)-2-{[3-(4',5'-Dihydro-3'-[4''-trifluoromethyl]phenyl-5'-isoxazolyl)-2-{[hydroxyl(2-phenyl-(1R)-1-{[(benzyloxy)carbonyl]-amino}ethyl)phosphinyl]methyl}-1-oxopropyl]amino}1H-Indole-3-propanoic Acid | CHEMBL570704
Type:
Small organic molecule
Emp. Form.:
C41H40F3N4O8P
Mol. Mass.:
804.7473
SMILES:
OC(=O)[C@H](Cc1c[nH]c2ccccc12)NC(=O)C(CC1CC(=NO1)c1ccc(cc1)C(F)(F)F)CP(O)(=O)[C@H](Cc1ccccc1)NC(=O)OCc1ccccc1
: