Target
Neprilysin
Ligand
BDBM50303319
Substrate
Meas. Tech.
ChEMBL_595725 (CHEMBL1045248)
Ki
172±n/a nM
Citation
 Jullien, NMakritis, AGeorgiadis, DBeau, FYiotakis, ADive, V Phosphinic tripeptides as dual angiotensin-converting enzyme C-domain and endothelin-converting enzyme-1 inhibitors. J Med Chem 53:208-20 (2010)  
Target
Name:
Neprilysin
Synonyms:
Atriopeptidase CD_antigen=CD10 EPN MME NEP_HUMAN Neutral endopeptidase | Neutral endopeptidase 24.11
Type:
Enzyme
Mol. Mass.:
85505.38
Organism:
Homo sapiens (Human)
Description:
P08473
Residue:
750
  
Inhibitor
Name:
BDBM50303319
Synonyms:
(S)-2-[(S)-3-[((R)-1-Benzyloxycarbonylamino-2-phenyl-ethyl)-hydroxy-phosphinoyl]-2-(3-phenyl-isoxazol-5-ylmethyl)-propionylamino]-3-(4-hydroxy-phenyl)-propionic acid | CHEMBL570732
Type:
Small organic molecule
Emp. Form.:
C38H38N3O9P
Mol. Mass.:
711.6968
SMILES:
OC(=O)[C@H](Cc1ccc(O)cc1)NC(=O)[C@H](Cc1cc(no1)-c1ccccc1)CP(O)(=O)[C@H](Cc1ccccc1)NC(=O)OCc1ccccc1
: