Target
Neutrophil elastase
Ligand
BDBM50303374
Substrate
Meas. Tech.
ChEMBL_595760 (CHEMBL1045283)
Ki
127±n/a nM
Citation
 Mulchande, JOliveira, RCarrasco, MGouveia, LGuedes, RCIley, JMoreira, R 4-Oxo-beta-lactams (azetidine-2,4-diones) are potent and selective inhibitors of human leukocyte elastase. J Med Chem 53:241-53 (2010)  
Target
Name:
Neutrophil elastase
Synonyms:
Bone marrow serine protease Coagulation factor X ELANE Elastase HLE Leukocyte elastase Medullasin Neutrophil elastase (HNE) PMN elastase Trypsin
Type:
Enzyme
Mol. Mass.:
28532.38
Organism:
Homo sapiens (Human)
Description:
P08246
Residue:
267
  
Inhibitor
Name:
BDBM50303374
Synonyms:
3-Benzyl-3-ethyl-1-phenylazetidine-2,4-dione | CHEMBL578583
Type:
Small organic molecule
Emp. Form.:
C18H17NO2
Mol. Mass.:
279.3331
SMILES:
CCC1(Cc2ccccc2)C(=O)N(C1=O)c1ccccc1
: