Target
Cruzipain
Ligand
BDBM50303421
Substrate
Meas. Tech.
ChEMBL_595795 (CHEMBL1048802)
IC50
0.4±n/a nM
Citation
 Mott, BTFerreira, RSSimeonov, AJadhav, AAng, KKLeister, WShen, MSilveira, JTDoyle, PSArkin, MRMcKerrow, JHInglese, JAustin, CPThomas, CJShoichet, BKMaloney, DJ Identification and optimization of inhibitors of Trypanosomal cysteine proteases: cruzain, rhodesain, and TbCatB. J Med Chem 53:52-60 (2010)  
Target
Name:
Cruzipain
Synonyms:
CYSP_TRYCR Cruzaine | Major cysteine proteinase
Type:
Protein
Mol. Mass.:
49831.41
Organism:
Trypanosoma cruzi
Description:
P25779
Residue:
467
  
Inhibitor
Name:
BDBM50303421
Synonyms:
6-(3-Chlorophenylamino)-9-ethyl-9H-purine-2-carbonitrile | CHEMBL577121
Type:
Small organic molecule
Emp. Form.:
C14H11ClN6
Mol. Mass.:
298.73
SMILES:
CCn1cnc2c(Nc3cccc(Cl)c3)nc(nc12)C#N
: