Target
Papain
Ligand
BDBM50303441
Substrate
Meas. Tech.
ChEMBL_595888 (CHEMBL1040868)
IC50
33.11±n/a nM
Citation
 Mott, BTFerreira, RSSimeonov, AJadhav, AAng, KKLeister, WShen, MSilveira, JTDoyle, PSArkin, MRMcKerrow, JHInglese, JAustin, CPThomas, CJShoichet, BKMaloney, DJ Identification and optimization of inhibitors of Trypanosomal cysteine proteases: cruzain, rhodesain, and TbCatB. J Med Chem 53:52-60 (2010)  
Target
Name:
Papain
Synonyms:
Allergen=Car p 1 PPI | Papaya proteinase I
Type:
Enzyme
Mol. Mass.:
38923.01
Organism:
Carica papaya
Description:
Papain was purchased from Sigma, Germany.
Residue:
345
  
Inhibitor
Name:
BDBM50303441
Synonyms:
9-(3,5-Difluorophenyl)-6-(ethylamino)-9H-purine-2-carbonitrile | CHEMBL567134
Type:
Small organic molecule
Emp. Form.:
C14H10F2N6
Mol. Mass.:
300.2662
SMILES:
CCNc1nc(nc2n(cnc12)-c1cc(F)cc(F)c1)C#N
: