Target
Cannabinoid receptor 1
Ligand
BDBM50303520
Substrate
Meas. Tech.
ChEMBL_596088 (CHEMBL1040876)
Ki
>10000±n/a nM
Citation
 Frost, JMDart, MJTietje, KRGarrison, TRGrayson, GKDaza, AVEl-Kouhen, OFYao, BBHsieh, GCPai, MZhu, CZChandran, PMeyer, MD Indol-3-ylcycloalkyl ketones: effects of N1 substituted indole side chain variations on CB(2) cannabinoid receptor activity. J Med Chem 53:295-315 (2010)  
Target
Name:
Cannabinoid receptor 1
Synonyms:
CANN6 CB-R CNR CNR1_HUMAN Cannabinoid receptor Cannabinoid receptor 1 (brain)
Type:
G Protein-Coupled Receptor (GPCR)
Mol. Mass.:
52868.96
Organism:
Homo sapiens (Human)
Description:
P21554
Residue:
472
  
Inhibitor
Name:
BDBM50303520
Synonyms:
CHEMBL571346 | Cyclobutyl(1-(2-morpholinoethyl)-1H-indol-3-yl)methanone
Type:
Small organic molecule
Emp. Form.:
C19H24N2O2
Mol. Mass.:
312.4061
SMILES:
O=C(C1CCC1)c1cn(CCN2CCOCC2)c2ccccc12
: