Target
Cannabinoid receptor 2
Ligand
BDBM50303550
Substrate
Meas. Tech.
ChEMBL_596087 (CHEMBL1040875)
Ki
8.3±n/a nM
Citation
 Frost, JMDart, MJTietje, KRGarrison, TRGrayson, GKDaza, AVEl-Kouhen, OFYao, BBHsieh, GCPai, MZhu, CZChandran, PMeyer, MD Indol-3-ylcycloalkyl ketones: effects of N1 substituted indole side chain variations on CB(2) cannabinoid receptor activity. J Med Chem 53:295-315 (2010)  
Target
Name:
Cannabinoid receptor 2
Synonyms:
CANNABINOID CB2 CB2 CB2B CNR2_HUMAN Cannabinoid CB2 receptor Cannabinoid receptor 2 (CB2R) | hCB2
Type:
G Protein-Coupled Receptor (GPCR)
Mol. Mass.:
39690.94
Organism:
Homo sapiens (Human)
Description:
P34972
Residue:
360
  
Inhibitor
Name:
BDBM50303550
Synonyms:
(1-(2-(5-Chloro-1,2,4-thiadiazol-3-yl)ethyl)-1H-indol-3-yl)(2,2,3,-3-tetramethylcyclopropyl)methanone | CHEMBL568796
Type:
Small organic molecule
Emp. Form.:
C20H22ClN3OS
Mol. Mass.:
387.926
SMILES:
CC1(C)C(C(=O)c2cn(CCc3nsc(Cl)n3)c3ccccc23)C1(C)C
: