Target
Cannabinoid receptor 2
Ligand
BDBM50303539
Substrate
Meas. Tech.
ChEMBL_596087 (CHEMBL1040875)
Ki
8.2±n/a nM
Citation
 Frost, JMDart, MJTietje, KRGarrison, TRGrayson, GKDaza, AVEl-Kouhen, OFYao, BBHsieh, GCPai, MZhu, CZChandran, PMeyer, MD Indol-3-ylcycloalkyl ketones: effects of N1 substituted indole side chain variations on CB(2) cannabinoid receptor activity. J Med Chem 53:295-315 (2010)  
Target
Name:
Cannabinoid receptor 2
Synonyms:
CANNABINOID CB2 CB2 CB2B CNR2_HUMAN Cannabinoid CB2 receptor Cannabinoid receptor 2 (CB2R) | hCB2
Type:
G Protein-Coupled Receptor (GPCR)
Mol. Mass.:
39690.94
Organism:
Homo sapiens (Human)
Description:
P34972
Residue:
360
  
Inhibitor
Name:
BDBM50303539
Synonyms:
(1-Benzyl-1H-indol-3-yl)(2,2,3,3-tetramethylcyclopropyl)methanone | CHEMBL571774
Type:
Small organic molecule
Emp. Form.:
C23H25NO
Mol. Mass.:
331.4507
SMILES:
CC1(C)C(C(=O)c2cn(Cc3ccccc3)c3ccccc23)C1(C)C
: