Target
Cannabinoid receptor 2
Ligand
BDBM50303538
Substrate
Meas. Tech.
ChEMBL_596087 (CHEMBL1040875)
Ki
0.99±n/a nM
Citation
 Frost, JMDart, MJTietje, KRGarrison, TRGrayson, GKDaza, AVEl-Kouhen, OFYao, BBHsieh, GCPai, MZhu, CZChandran, PMeyer, MD Indol-3-ylcycloalkyl ketones: effects of N1 substituted indole side chain variations on CB(2) cannabinoid receptor activity. J Med Chem 53:295-315 (2010)  
Target
Name:
Cannabinoid receptor 2
Synonyms:
CANNABINOID CB2 CB2 CB2B CNR2_HUMAN Cannabinoid CB2 receptor Cannabinoid receptor 2 (CB2R) | hCB2
Type:
G Protein-Coupled Receptor (GPCR)
Mol. Mass.:
39690.94
Organism:
Homo sapiens (Human)
Description:
P34972
Residue:
360
  
Inhibitor
Name:
BDBM50303538
Synonyms:
6-(3-(2,2,3,3-Tetramethylcyclopropanecarbonyl)-1H-indol-1-yl)-hexan-2-one | CHEMBL584105
Type:
Small organic molecule
Emp. Form.:
C22H29NO2
Mol. Mass.:
339.4712
SMILES:
CC(=O)CCCCn1cc(C(=O)C2C(C)(C)C2(C)C)c2ccccc12
: