Target
Cannabinoid receptor 2
Ligand
BDBM50303533
Substrate
Meas. Tech.
ChEMBL_596090 (CHEMBL1040878)
EC50
26±n/a nM
Citation
 Frost, JMDart, MJTietje, KRGarrison, TRGrayson, GKDaza, AVEl-Kouhen, OFYao, BBHsieh, GCPai, MZhu, CZChandran, PMeyer, MD Indol-3-ylcycloalkyl ketones: effects of N1 substituted indole side chain variations on CB(2) cannabinoid receptor activity. J Med Chem 53:295-315 (2010)  
Target
Name:
Cannabinoid receptor 2
Synonyms:
CANNABINOID CB2 CB2 CB2B CNR2_HUMAN Cannabinoid CB2 receptor Cannabinoid receptor 2 (CB2R) | hCB2
Type:
G Protein-Coupled Receptor (GPCR)
Mol. Mass.:
39690.94
Organism:
Homo sapiens (Human)
Description:
P34972
Residue:
360
  
Inhibitor
Name:
BDBM50303533
Synonyms:
(1-(3-Methoxypropyl)-1H-indol-3-yl)(2,2,3,3-tetramethylcyclopropyl)methanone | CHEMBL572000
Type:
Small organic molecule
Emp. Form.:
C20H27NO2
Mol. Mass.:
313.4339
SMILES:
COCCCn1cc(C(=O)C2C(C)(C)C2(C)C)c2ccccc12
: