Target
Cannabinoid receptor 2
Ligand
BDBM50303582
Substrate
Meas. Tech.
ChEMBL_596090 (CHEMBL1040878)
EC50
31±n/a nM
Citation
 Frost, JMDart, MJTietje, KRGarrison, TRGrayson, GKDaza, AVEl-Kouhen, OFYao, BBHsieh, GCPai, MZhu, CZChandran, PMeyer, MD Indol-3-ylcycloalkyl ketones: effects of N1 substituted indole side chain variations on CB(2) cannabinoid receptor activity. J Med Chem 53:295-315 (2010)  
Target
Name:
Cannabinoid receptor 2
Synonyms:
CANNABINOID CB2 CB2 CB2B CNR2_HUMAN Cannabinoid CB2 receptor Cannabinoid receptor 2 (CB2R) | hCB2
Type:
G Protein-Coupled Receptor (GPCR)
Mol. Mass.:
39690.94
Organism:
Homo sapiens (Human)
Description:
P34972
Residue:
360
  
Inhibitor
Name:
BDBM50303582
Synonyms:
CHEMBL570659 | Cycloheptyl(1-(2-morpholinoethyl)-1H-indol-3-yl)methanone
Type:
Small organic molecule
Emp. Form.:
C22H30N2O2
Mol. Mass.:
354.4858
SMILES:
O=C(C1CCCCCC1)c1cn(CCN2CCOCC2)c2ccccc12
: