Target
Cannabinoid receptor 2
Ligand
BDBM50303572
Substrate
Meas. Tech.
ChEMBL_596087 (CHEMBL1040875)
Ki
2.1±n/a nM
Citation
 Frost, JMDart, MJTietje, KRGarrison, TRGrayson, GKDaza, AVEl-Kouhen, OFYao, BBHsieh, GCPai, MZhu, CZChandran, PMeyer, MD Indol-3-ylcycloalkyl ketones: effects of N1 substituted indole side chain variations on CB(2) cannabinoid receptor activity. J Med Chem 53:295-315 (2010)  
Target
Name:
Cannabinoid receptor 2
Synonyms:
CANNABINOID CB2 CB2 CB2B CNR2_HUMAN Cannabinoid CB2 receptor Cannabinoid receptor 2 (CB2R) | hCB2
Type:
G Protein-Coupled Receptor (GPCR)
Mol. Mass.:
39690.94
Organism:
Homo sapiens (Human)
Description:
P34972
Residue:
360
  
Inhibitor
Name:
BDBM50303572
Synonyms:
CHEMBL571999 | [1-((Tetrahydro-2H-pyran-4-yl)methyl](3-noradamantane)methanone
Type:
Small organic molecule
Emp. Form.:
C24H29NO2
Mol. Mass.:
363.4926
SMILES:
O=C(c1cn(CC2CCOCC2)c2ccccc12)C12CC3CC1CC(C2)C3
: