Target
Proprotein convertase subtilisin/kexin type 7
Ligand
BDBM50303777
Substrate
Meas. Tech.
ChEMBL_597566 (CHEMBL1049703)
Ki
>10000±n/a nM
Citation
 Becker, GLSielaff, FThan, MELindberg, IRouthier, SDay, RLu, YGarten, WSteinmetzer, T Potent inhibitors of furin and furin-like proprotein convertases containing decarboxylated P1 arginine mimetics. J Med Chem 53:1067-75 (2010)  
Target
Name:
Proprotein convertase subtilisin/kexin type 7
Synonyms:
LPC PC7 PCSK7 Prohormone convertase PC7 Proprotein convertase subtilisin/kexin type 7 Subtilisin/kexin type 7 hPC8
Type:
PROTEIN
Mol. Mass.:
86233.43
Organism:
Homo sapiens (Human)
Description:
ChEMBL_1290739
Residue:
785
  
Inhibitor
Name:
BDBM50303777
Synonyms:
(S)-5-guanidino-N-((S)-1-((S)-5-guanidino-1-(3-guanidinopropylamino)-1-oxopentan-2-ylamino)-3-methyl-1-oxobutan-2-yl)-2-(2-phenylacetamido)pentanamide | CHEMBL569280
Type:
Small organic molecule
Emp. Form.:
C30H53N13O4
Mol. Mass.:
659.8265
SMILES:
[#6]-[#6](-[#6])-[#6@H](-[#7]-[#6](=O)-[#6@H](-[#6]-[#6]-[#6]\[#7]=[#6](/[#7])-[#7])-[#7]-[#6](=O)-[#6]-c1ccccc1)-[#6](=O)-[#7]-[#6@@H](-[#6]-[#6]-[#6]\[#7]=[#6](/[#7])-[#7])-[#6](=O)-[#7]-[#6]-[#6]-[#6]-[#6]\[#7]=[#6](\[#7])-[#7]
: