Target
D(3) dopamine receptor
Ligand
BDBM50020221
Substrate
Meas. Tech.
ChEMBL_597580 (CHEMBL1050543)
EC50
1.23±n/a nM
Citation
 Ghosh, BAntonio, TZhen, JKharkar, PReith, MEDutta, AK Development of (S)-N6-(2-(4-(isoquinolin-1-yl)piperazin-1-yl)ethyl)-N6-propyl-4,5,6,7-tetrahydrobenzo[d]-thiazole-2,6-diamine and its analogue as a D3 receptor preferring agonist: potent in vivo activity in Parkinson's disease animal models. J Med Chem 53:1023-37 (2010)  
Target
Name:
D(3) dopamine receptor
Synonyms:
DOPAMINE D3 DRD3_HUMAN Dopamine D3 receptor (D3) Dopamine receptor Dopamine receptor D3
Type:
Mol. Mass.:
44243.43
Organism:
Homo sapiens (Human)
Description:
Residue:
400
  
Inhibitor
Name:
BDBM50020221
Synonyms:
(-)-5-hydroxy-2-(dipropylamino)tetralin 5-hydroxy-2-(dipropylamino)tetralin 6-Dipropylamino-5,6,7,8-tetrahydro-naphthalen-1-ol (DP-5-ADTN) | CHEMBL273273
Type:
Small organic molecule
Emp. Form.:
C16H25NO
Mol. Mass.:
247.3758
SMILES:
CCCN(CCC)C1CCc2c(O)cccc2C1
: