Target
Epidermal growth factor receptor
Ligand
BDBM50304193
Substrate
Meas. Tech.
ChEMBL_605391 (CHEMBL1073385)
EC50
>10000±n/a nM
Citation
 Tasler, SMüller, OWieber, THerz, TPegoraro, SSaeb, WLang, MKrauss, RTotzke, FZirrgiebel, UEhlert, JEKubbutat, MHSchächtele, C Substituted 2-arylbenzothiazoles as kinase inhibitors: hit-to-lead optimization. Bioorg Med Chem 17:6728-37 (2009)  
Target
Name:
Epidermal growth factor receptor
Synonyms:
EGF Receptor Substrate EGFR_HUMAN ERBB1 Epidermal Growth Factor Receptor erbB-1 Epidermal growth factor receptor (EGFR) HER1 Proto-oncogene c-ErbB-1 Tyrosine-Protein Kinase ErbB-1
Type:
Receptor Kinase Domain
Mol. Mass.:
134279.59
Organism:
Homo sapiens (Human)
Description:
P00533
Residue:
1210
  
Inhibitor
Name:
BDBM50304193
Synonyms:
CHEMBL593221 | N-[4-(Benzo[d]thiazol-2''-yl)-2-hydroxyphenyl]-6'-methoxy-7'-[3-(4-methylpiperazin-1-yl)propoxy]quinazolin-4'-amine
Type:
Small organic molecule
Emp. Form.:
C31H34N6O3S
Mol. Mass.:
570.705
SMILES:
COc1cc(ccc1Nc1ncnc2cc(OCCCN3CCN(C)CC3)c(OC)cc12)-c1nc2ccccc2s1
: