Target
Aurora kinase B
Ligand
BDBM50304195
Substrate
Meas. Tech.
ChEMBL_605383 (CHEMBL1073377)
IC50
59±n/a nM
Citation
 Tasler, SMüller, OWieber, THerz, TPegoraro, SSaeb, WLang, MKrauss, RTotzke, FZirrgiebel, UEhlert, JEKubbutat, MHSchächtele, C Substituted 2-arylbenzothiazoles as kinase inhibitors: hit-to-lead optimization. Bioorg Med Chem 17:6728-37 (2009)  
Target
Name:
Aurora kinase B
Synonyms:
AIK2 AIM1 ARK2 AURKB_HUMAN Aurora B-INCENP Aurora kinase B (AURKB) STK-1 STK12 Serine/threonine-protein kinase aurora B
Type:
Protein
Mol. Mass.:
39327.72
Organism:
Homo sapiens (Human)
Description:
Q96GD4
Residue:
344
  
Inhibitor
Name:
BDBM50304195
Synonyms:
CHEMBL606466 | N-[4-(Benzo[d]thiazol-2''-yl)-3-methylphenyl]-6'-methoxy-7'-[3-(4-methylpiperazin-1-yl)propoxy]quinazolin-4'-amine
Type:
Small organic molecule
Emp. Form.:
C30H32N6O3S
Mol. Mass.:
556.678
SMILES:
COc1cc2c(Nc3ccc(-c4nc5ccccc5s4)c(O)c3)ncnc2cc1OCCCN1CCN(C)CC1
: