Target
Seed linoleate 13S-lipoxygenase-1
Ligand
BDBM50150484
Substrate
Meas. Tech.
ChEMBL_606150 (CHEMBL1074616)
Ki
22000±n/a nM
Citation
 Wecksler, ATGarcia, NKHolman, TR Substrate specificity effects of lipoxygenase products and inhibitors on soybean lipoxygenase-1. Bioorg Med Chem 17:6534-9 (2009)  
Target
Name:
Seed linoleate 13S-lipoxygenase-1
Synonyms:
15-LOX 15-lipo-oxygenase (SLO) L-1 LOX1.1 Lipoxygenase (LOX) Lipoxygenase-1 | Seed lipoxygenase-1
Type:
Enzyme
Mol. Mass.:
94365.66
Organism:
Glycine max (soybean)
Description:
Residue:
839
  
Inhibitor
Name:
BDBM50150484
Synonyms:
(Z)-9-octadecenoic acid CHEMBL8659 Octadec-9-enoic acid oleicacid
Type:
Small organic molecule
Emp. Form.:
C18H34O2
Mol. Mass.:
282.4614
SMILES:
CCCCCCCC\C=C/CCCCCCCC(O)=O
: