Target
Acetylcholinesterase
Ligand
BDBM50304320
Substrate
Meas. Tech.
ChEMBL_606474 (CHEMBL1065425)
IC50
16±n/a nM
Citation
 Yan, JSun, LWu, GYi, PYang, FZhou, LZhang, XLi, ZYang, XLuo, HQiu, M Rational design and synthesis of highly potent anti-acetylcholinesterase activity huperzine A derivatives. Bioorg Med Chem 17:6937-41 (2009)  
Target
Name:
Acetylcholinesterase
Synonyms:
ACES_HUMAN Acetylcholinesterase (AChE) | Acetylcholinesterase (human AChE)
Type:
Enzyme
Mol. Mass.:
67792.70
Organism:
Homo sapiens (Human)
Description:
P22303
Residue:
614
  
Inhibitor
Name:
BDBM50304320
Synonyms:
(1R,9R)-13-Eth-(E)-ylidene-1-{[1-(4-hydroxy-3-methoxy-phenyl)-methylidene]-amino}-11-methyl-6-aza-tricyclo[7.3.1.0*2,7*]trideca-2(7),3,10-trien-5-one | CHEMBL604478
Type:
Small organic molecule
Emp. Form.:
C23H24N2O3
Mol. Mass.:
376.4483
SMILES:
COc1cc(\C=N\[C@@]23CC(C)=C[C@@H](Cc4[nH]c(=O)ccc24)\C3=C/C)ccc1O
: