Target
Acetylcholinesterase
Ligand
BDBM50304327
Substrate
Meas. Tech.
ChEMBL_606474 (CHEMBL1065425)
IC50
24±n/a nM
Citation
 Yan, JSun, LWu, GYi, PYang, FZhou, LZhang, XLi, ZYang, XLuo, HQiu, M Rational design and synthesis of highly potent anti-acetylcholinesterase activity huperzine A derivatives. Bioorg Med Chem 17:6937-41 (2009)  
Target
Name:
Acetylcholinesterase
Synonyms:
ACES_HUMAN Acetylcholinesterase (AChE) | Acetylcholinesterase (human AChE)
Type:
Enzyme
Mol. Mass.:
67792.70
Organism:
Homo sapiens (Human)
Description:
P22303
Residue:
614
  
Inhibitor
Name:
BDBM50304327
Synonyms:
13-Ethylidene-11-methyl-1-[3-phenyl-prop-2-enylideneamino]-6-aza-tricyclo[7.3.1.0*2,7*]trideca-2(7),3,10-trien-5-one | CHEMBL595114
Type:
Small organic molecule
Emp. Form.:
C24H24N2O
Mol. Mass.:
356.4602
SMILES:
C\C=C1/[C@@H]2Cc3[nH]c(=O)ccc3[C@]1(CC(C)=C2)\N=C\C=C\c1ccccc1
: