Target
Endothelin-1 receptor
Ligand
BDBM50304499
Substrate
Meas. Tech.
ChEMBL_603857 (CHEMBL1046474)
Ki
25±n/a nM
Citation
 Höltke, CLaw, MPWagner, SKopka, KFaust, ABreyholz, HJSchober, OBremer, CRiemann, BSchäfers, M PET-compatible endothelin receptor radioligands: synthesis and first in vitro and in vivo studies. Bioorg Med Chem 17:7197-208 (2009)  
Target
Name:
Endothelin-1 receptor
Synonyms:
EDNRA_MOUSE Endothelin receptor ET-A | Gpcr10
Type:
PROTEIN
Mol. Mass.:
48591.87
Organism:
Mus musculus
Description:
ChEMBL_723169
Residue:
427
  
Inhibitor
Name:
BDBM50304499
Synonyms:
3-Benzo[1,3]dioxol-5-yl-5-hydroxy-5-[4-(2-bromoethoxy)-phenyl]-4-(3,4,5-trimethoxybenzyl)-5H-furan-2-one | CHEMBL603635
Type:
Small organic molecule
Emp. Form.:
C29H27BrO9
Mol. Mass.:
599.423
SMILES:
COc1cc(CC2=C(C(=O)OC2(O)c2ccc(OCCBr)cc2)c2ccc3OCOc3c2)cc(OC)c1OC
: