Target
Histamine H4 receptor
Ligand
BDBM50304508
Substrate
Meas. Tech.
ChEMBL_603902 (CHEMBL1048581)
Ki
716±n/a nM
Citation
 Sander, KKottke, TTanrikulu, YProschak, EWeizel, LSchneider, EHSeifert, RSchneider, GStark, H 2,4-Diaminopyrimidines as histamine H4 receptor ligands--Scaffold optimization and pharmacological characterization. Bioorg Med Chem 17:7186-96 (2009)  
Target
Name:
Histamine H4 receptor
Synonyms:
AXOR35 GPCR105 HH4R HRH4 Histamine H4 receptor Histamine receptor (H3 and H4) SP9144
Type:
G Protein-Coupled Receptor (GPCR)
Mol. Mass.:
44517.02
Organism:
Homo sapiens (Human)
Description:
Binding assays were using CHO cells stably expressing hH4R receptors.
Residue:
390
  
Inhibitor
Name:
BDBM50304508
Synonyms:
CHEMBL593551 | N4-(Biphenyl-4-ylmethyl)-6-(4-methylpiperazin-1-yl)pyrimidine-2,4-diamine
Type:
Small organic molecule
Emp. Form.:
C22H26N6
Mol. Mass.:
374.482
SMILES:
CN1CCN(CC1)c1cc(NCc2ccc(cc2)-c2ccccc2)nc(N)n1
: