Target
72 kDa type IV collagenase
Ligand
BDBM23971
Substrate
Meas. Tech.
ChEMBL_604357 (CHEMBL1068640)
IC50
162000±n/a nM
Citation
 Liu, YShang, LFang, HZhu, HMu, JWang, QWang, XYuan, YXu, W Design, synthesis, and preliminary studies of the activity of novel derivatives of N-cinnamoyl-L-aspartic acid as inhibitors of aminopeptidase N/CD13. Bioorg Med Chem 17:7398-404 (2009)  
Target
Name:
72 kDa type IV collagenase
Synonyms:
72 kDa gelatinase CLG4A Gelatinase A (MMP-2) MMP2_HUMAN Matrix metalloproteinase-2 (MMP 2) Matrix metalloproteinases 2 (MMP-2) | TBE-1
Type:
Enzyme
Mol. Mass.:
73870.36
Organism:
Homo sapiens (Human)
Description:
P08253
Residue:
660
  
Inhibitor
Name:
BDBM23971
Synonyms:
(2S)-2-[(2S,3R)-3-amino-2-hydroxy-4-phenylbutanamido]-4-methylpentanoic acid CHEMBL29292 | Ubenimex
Type:
Small organic molecule
Emp. Form.:
C16H24N2O4
Mol. Mass.:
308.3728
SMILES:
CC(C)C[C@H](NC(=O)[C@@H](O)[C@H](N)Cc1ccccc1)C(O)=O
: