Target
Adenosine receptor A3
Ligand
BDBM50304638
Substrate
Meas. Tech.
ChEMBL_604437 (CHEMBL1070693)
Ki
2.16±n/a nM
Citation
 Choi, WJLee, HWKim, HOChinn, MGao, ZGPatel, AJacobson, KAMoon, HRJung, YHJeong, LS Design and synthesis of N(6)-substituted-4'-thioadenosine-5'-uronamides as potent and selective human A(3) adenosine receptor agonists. Bioorg Med Chem 17:8003-11 (2009)  
Target
Name:
Adenosine receptor A3
Synonyms:
A3 adenosine receptor (hA3) ADORA3 | Adenosine A3 receptor (A3AR)
Type:
G Protein-Coupled Receptor (GPCR)
Mol. Mass.:
36197.32
Organism:
Homo sapiens (Human)
Description:
P0DMS8
Residue:
318
  
Inhibitor
Name:
BDBM50304638
Synonyms:
9-(5'-Cyclopropylaminocarbonyl-4'-thio-beta-D-ribofuranosyl)-N6-methyladenine | CHEMBL596460
Type:
Small organic molecule
Emp. Form.:
C14H18N6O3S
Mol. Mass.:
350.396
SMILES:
CNc1ncnc2n(cnc12)[C@@H]1S[C@@H]([C@@H](O)[C@H]1O)C(=O)NC1CC1
: