Target
Transient receptor potential cation channel subfamily V member 1
Ligand
BDBM50304768
Substrate
Meas. Tech.
ChEMBL_605565 (CHEMBL1067319)
IC50
80±n/a nM
Citation
 Li, FNKim, NJChang, DJJang, JJang, HJung, JWMin, KHJeong, YSKim, SYPark, YHKim, HDPark, HGSuh, YG Synthesis and structural optimization of multiple H-bonding region of diarylalkyl (thio)amides as novel TRPV1 antagonists. Bioorg Med Chem 17:8149-60 (2009)  
Target
Name:
Transient receptor potential cation channel subfamily V member 1
Synonyms:
Capsaicin receptor TRPV1_RAT Trpv1 Vanilloid VR1 Vanilloid receptor 1 (VRI/TRPV1) Vanilloid receptor type 1-like (TrpV1/Vr1) Vr1l | osm-9-like TRP channel 1
Type:
Transient Receptor
Mol. Mass.:
94956.12
Organism:
Rattus norvegicus (rat)
Description:
O35433
Residue:
838
  
Inhibitor
Name:
BDBM50304768
Synonyms:
3-(4-tert-Butylphenyl)-N-[3-chloro-5-methyl-4-(methylsulfonamido)benzyl]propanethioamide | CHEMBL605103
Type:
Small organic molecule
Emp. Form.:
C22H29ClN2O2S2
Mol. Mass.:
453.061
SMILES:
Cc1cc(CNC(=S)CCc2ccc(cc2)C(C)(C)C)cc(Cl)c1NS(C)(=O)=O
: