Target
Transient receptor potential cation channel subfamily V member 1
Ligand
BDBM50304772
Substrate
Meas. Tech.
ChEMBL_605565 (CHEMBL1067319)
IC50
75±n/a nM
Citation
 Li, FNKim, NJChang, DJJang, JJang, HJung, JWMin, KHJeong, YSKim, SYPark, YHKim, HDPark, HGSuh, YG Synthesis and structural optimization of multiple H-bonding region of diarylalkyl (thio)amides as novel TRPV1 antagonists. Bioorg Med Chem 17:8149-60 (2009)  
Target
Name:
Transient receptor potential cation channel subfamily V member 1
Synonyms:
Capsaicin receptor TRPV1_RAT Trpv1 Vanilloid VR1 Vanilloid receptor 1 (VRI/TRPV1) Vanilloid receptor type 1-like (TrpV1/Vr1) Vr1l | osm-9-like TRP channel 1
Type:
Transient Receptor
Mol. Mass.:
94956.12
Organism:
Rattus norvegicus (rat)
Description:
O35433
Residue:
838
  
Inhibitor
Name:
BDBM50304772
Synonyms:
3-(4-tert-Butylphenyl)-N-[3-acetylene-5-fluoro-4-(methylsulfonamido)benzyl]propanethioamide | CHEMBL596319
Type:
Small organic molecule
Emp. Form.:
C23H27FN2O2S2
Mol. Mass.:
446.601
SMILES:
CC(C)(C)c1ccc(CCC(=S)NCc2cc(F)c(NS(C)(=O)=O)c(c2)C#C)cc1
: