Target
Papain
Ligand
BDBM50304794
Substrate
Meas. Tech.
ChEMBL_606254 (CHEMBL1069944)
Ki
8.2±n/a nM
Citation
 Löser, RGut, JRosenthal, PJFrizler, MGütschow, MAndrews, KT Antimalarial activity of azadipeptide nitriles. Bioorg Med Chem Lett 20:252-5 (2010)  
Target
Name:
Papain
Synonyms:
Allergen=Car p 1 PPI | Papaya proteinase I
Type:
Enzyme
Mol. Mass.:
38923.01
Organism:
Carica papaya
Description:
Papain was purchased from Sigma, Germany.
Residue:
345
  
Inhibitor
Name:
BDBM50304794
Synonyms:
(S)-benzyl 1-(2-cyano-1,2-dimethylhydrazinyl)-4-methyl-1-oxopentan-2-ylcarbamate acs.jmedchem.1c00409_ST.401
Type:
Small organic molecule
Emp. Form.:
C17H24N4O3
Mol. Mass.:
332.3975
SMILES:
CC(C)C[C@H](NC(=O)OCc1ccccc1)C(=O)N(C)N(C)C#N
: