Target
5-hydroxytryptamine receptor 2C
Ligand
BDBM50016970
Substrate
Meas. Tech.
ChEMBL_606255 (CHEMBL1069945)
EC50
187±n/a nM
Citation
 Liu, KKCornelius, PPatterson, TAZeng, YSantucci, STomlinson, EGibbons, CMaurer, TSMarala, RBrown, JKong, JXLee, EWerner, WWenzel, ZVage, C Design and synthesis of orally-active and selective azaindane 5HT2c agonist for the treatment of obesity. Bioorg Med Chem Lett 20:266-71 (2010)  
Target
Name:
5-hydroxytryptamine receptor 2C
Synonyms:
5-HT-2C 5-HT2C-INI 5-HTR2C 5-hydroxytryptamine receptor 2C (5-HT-2C) 5HT-1C HTR1C Serotonin (5-HT3) receptor Serotonin Receptor 2C
Type:
G Protein-Coupled Receptor (GPCR)
Mol. Mass.:
51836.79
Organism:
Homo sapiens (Human)
Description:
P28335
Residue:
458
  
Inhibitor
Name:
BDBM50016970
Synonyms:
4-Piperazin-1-yl-thieno[3,2-c]pyridine; hydrochloride CHEMBL608135
Type:
Small organic molecule
Emp. Form.:
C11H13N3S
Mol. Mass.:
219.306
SMILES:
C1CN(CCN1)c1nccc2sccc12
: