Target
5-hydroxytryptamine receptor 2A
Ligand
BDBM50304800
Substrate
Meas. Tech.
ChEMBL_606260 (CHEMBL1069950)
EC50
1500±n/a nM
Citation
 Liu, KKCornelius, PPatterson, TAZeng, YSantucci, STomlinson, EGibbons, CMaurer, TSMarala, RBrown, JKong, JXLee, EWerner, WWenzel, ZVage, C Design and synthesis of orally-active and selective azaindane 5HT2c agonist for the treatment of obesity. Bioorg Med Chem Lett 20:266-71 (2010)  
Target
Name:
5-hydroxytryptamine receptor 2A
Synonyms:
5-HT-2 5-HT2A 5-hydroxytryptamine receptor 2A (5HT-2A) 5HT2A_HUMAN HTR2A | Serotonin receptor 2A
Type:
undefined
Mol. Mass.:
52607.65
Organism:
Homo sapiens (Human)
Description:
P28223
Residue:
471
  
Inhibitor
Name:
BDBM50304800
Synonyms:
(S)-7-(2,5-difluorobenzyloxy)-2-(piperazin-1-yl)-6,7-dihydro-5H-cyclopenta[b]pyridine | CHEMBL594469
Type:
Small organic molecule
Emp. Form.:
C19H21F2N3O
Mol. Mass.:
345.3863
SMILES:
Fc1ccc(F)c(CO[C@H]2CCc3ccc(nc23)N2CCNCC2)c1
: