Target
5-hydroxytryptamine receptor 2B
Ligand
BDBM50304807
Substrate
Meas. Tech.
ChEMBL_606262 (CHEMBL1069952)
EC50
566±n/a nM
Citation
 Liu, KKCornelius, PPatterson, TAZeng, YSantucci, STomlinson, EGibbons, CMaurer, TSMarala, RBrown, JKong, JXLee, EWerner, WWenzel, ZVage, C Design and synthesis of orally-active and selective azaindane 5HT2c agonist for the treatment of obesity. Bioorg Med Chem Lett 20:266-71 (2010)  
Target
Name:
5-hydroxytryptamine receptor 2B
Synonyms:
5-HT-2B 5-hydroxytryptamine (serotonin) receptor 2B [Homo sapiens] 5-hydroxytryptamine receptor 2C (5HT2C) HTR2B Serotonin 2b (5-HT2b) receptor | Serotonin Receptor 2B
Type:
G Protein-Coupled Receptor (GPCR)
Mol. Mass.:
54312.47
Organism:
Homo sapiens (Human)
Description:
Receptor binding assays were performed using human clone stably expressed in CHO cells.
Residue:
481
  
Inhibitor
Name:
BDBM50304807
Synonyms:
(S)-7-(5-fluoro-2-methylbenzyloxy)-2-((R)-2-methylpiperazin-1-yl)-6,7-dihydro-5H-cyclopenta[b]pyridine | CHEMBL594717
Type:
Small organic molecule
Emp. Form.:
C21H26FN3O
Mol. Mass.:
355.449
SMILES:
C[C@@H]1CNCCN1c1ccc2CC[C@H](OCc3cc(F)ccc3C)c2n1
: