Target
5-hydroxytryptamine receptor 2A
Ligand
BDBM50304820
Substrate
Meas. Tech.
ChEMBL_606264 (CHEMBL1069954)
Ki
21±n/a nM
Citation
 Liu, KKCornelius, PPatterson, TAZeng, YSantucci, STomlinson, EGibbons, CMaurer, TSMarala, RBrown, JKong, JXLee, EWerner, WWenzel, ZVage, C Design and synthesis of orally-active and selective azaindane 5HT2c agonist for the treatment of obesity. Bioorg Med Chem Lett 20:266-71 (2010)  
Target
Name:
5-hydroxytryptamine receptor 2A
Synonyms:
5-HT-2A 5-HT2A 5-hydroxytryptamine receptor 2A (5HT2A) Htr2 Serotonin Receptor 2A
Type:
G Protein-Coupled Receptor (GPCR)
Mol. Mass.:
52852.05
Organism:
Rattus norvegicus (rat)
Description:
Rat cortex membranes 5-HT2A receptors.
Residue:
471
  
Inhibitor
Name:
BDBM50304820
Synonyms:
2-(piperazin-1-yl)-5,6,7,8-tetrahydroquinoline | CHEMBL593547
Type:
Small organic molecule
Emp. Form.:
C13H19N3
Mol. Mass.:
217.3101
SMILES:
C1CCc2nc(ccc2C1)N1CCNCC1
: