Target
TGF-beta receptor type-1
Ligand
BDBM50304871
Substrate
Meas. Tech.
ChEMBL_606316 (CHEMBL1070008)
Ki
365±n/a nM
Citation
 Guckian, KCarter, MBLin, EYChoi, MSun, LBoriack-Sjodin, PAChuaqui, CLane, BCheung, KLing, LLee, WC Pyrazolone based TGFbetaR1 kinase inhibitors. Bioorg Med Chem Lett 20:326-9 (2010)  
Target
Name:
TGF-beta receptor type-1
Synonyms:
ALK-5 Activin A receptor type II-like protein kinase of 53kD SKR4 TGF-beta receptor type I TGFBR1 TGFR1_HUMAN Transforming growth factor-beta receptor type I
Type:
enzyme
Mol. Mass.:
55968.24
Organism:
Homo sapiens (Human)
Description:
P36897
Residue:
503
  
Inhibitor
Name:
BDBM50304871
Synonyms:
1,2-dimethyl-5-(quinoxalin-6-yl)-4-(thiophen-2-yl)-1H-pyrazol-3(2H)-one | CHEMBL593704
Type:
Small organic molecule
Emp. Form.:
C17H14N4OS
Mol. Mass.:
322.384
SMILES:
Cn1c(c(-c2cccs2)c(=O)n1C)-c1ccc2nccnc2c1
: