Target
Cannabinoid receptor 1
Ligand
BDBM50304918
Substrate
Meas. Tech.
ChEMBL_606627 (CHEMBL1071854)
Ki
830±n/a nM
Citation
 Sellitto, ILe Bourdonnec, BWorm, KGoodman, ASavolainen, MAChu, GHAjello, CWSaeui, CTLeister, LKCassel, JADehaven, RNLabuda, CJKoblish, MLittle, PJBrogdon, BLSmith, SADolle, RE Novel sulfamoyl benzamides as selective CB(2) agonists with improved in vitro metabolic stability. Bioorg Med Chem Lett 20:387-91 (2010)  
Target
Name:
Cannabinoid receptor 1
Synonyms:
CANN6 CB-R CNR CNR1_HUMAN Cannabinoid receptor Cannabinoid receptor 1 (brain)
Type:
G Protein-Coupled Receptor (GPCR)
Mol. Mass.:
52868.96
Organism:
Homo sapiens (Human)
Description:
P21554
Residue:
472
  
Inhibitor
Name:
BDBM50304918
Synonyms:
CHEMBL595035 | N-(3,4-dimethyl-5-(morpholinosulfonyl)phenyl)-2,2-dimethylpentanamide
Type:
Small organic molecule
Emp. Form.:
C19H30N2O4S
Mol. Mass.:
382.518
SMILES:
CCCC(C)(C)C(=O)Nc1cc(C)c(C)c(c1)S(=O)(=O)N1CCOCC1
: