Target
Cannabinoid receptor 2
Ligand
BDBM50304914
Substrate
Meas. Tech.
ChEMBL_606628 (CHEMBL1071855)
Ki
16±n/a nM
Citation
 Sellitto, ILe Bourdonnec, BWorm, KGoodman, ASavolainen, MAChu, GHAjello, CWSaeui, CTLeister, LKCassel, JADehaven, RNLabuda, CJKoblish, MLittle, PJBrogdon, BLSmith, SADolle, RE Novel sulfamoyl benzamides as selective CB(2) agonists with improved in vitro metabolic stability. Bioorg Med Chem Lett 20:387-91 (2010)  
Target
Name:
Cannabinoid receptor 2
Synonyms:
CANNABINOID CB2 CB2 CB2B CNR2_HUMAN Cannabinoid CB2 receptor Cannabinoid receptor 2 (CB2R) | hCB2
Type:
G Protein-Coupled Receptor (GPCR)
Mol. Mass.:
39690.94
Organism:
Homo sapiens (Human)
Description:
P34972
Residue:
360
  
Inhibitor
Name:
BDBM50304914
Synonyms:
CHEMBL593166 | N-(3,4-dimethyl-5-(morpholinosulfonyl)phenyl)-2,2,3,3-tetramethylcyclopropanecarboxamide
Type:
Small organic molecule
Emp. Form.:
C20H30N2O4S
Mol. Mass.:
394.528
SMILES:
Cc1cc(NC(=O)C2C(C)(C)C2(C)C)cc(c1C)S(=O)(=O)N1CCOCC1
: