Target
MAP kinase-activated protein kinase 2
Ligand
BDBM50304993
Substrate
Meas. Tech.
ChEMBL_606910 (CHEMBL1072653)
IC50
5400±n/a nM
Citation
 Harris, CMEricsson, AMArgiriadi, MABarberis, CBorhani, DWBurchat, ACalderwood, DJCunha, GADixon, RWFrank, KEJohnson, EFKamens, JKwak, SLi, BMullen, KDPerron, DCWang, LWishart, NWu, XZhang, XZmetra, TRTalanian, RV 2,4-Diaminopyrimidine MK2 inhibitors. Part II: Structure-based inhibitor optimization. Bioorg Med Chem Lett 20:334-7 (2010)  
Target
Name:
MAP kinase-activated protein kinase 2
Synonyms:
MAP kinase-activated protein kinase 2 (MAPKAPK2) MAP kinase-activated protein kinase 2 (p38/MK2) MAPK-activated protein kinase 2 MAPKAP kinase 2 MAPKAPK2 | MK2
Type:
Serine/threonine-protein kinase
Mol. Mass.:
45579.87
Organism:
Homo sapiens (Human)
Description:
P49137
Residue:
400
  
Inhibitor
Name:
BDBM50304993
Synonyms:
CHEMBL591328 | N4-(7-(thiophen-3-yl)-1H-indazol-5-yl)pyrimidine-2,4-diamine
Type:
Small organic molecule
Emp. Form.:
C15H12N6S
Mol. Mass.:
308.361
SMILES:
Nc1nccc(Nc2cc(-c3ccsc3)c3[nH]ncc3c2)n1
: