Target
MAP kinase-activated protein kinase 2
Ligand
BDBM50305005
Substrate
Meas. Tech.
ChEMBL_606910 (CHEMBL1072653)
IC50
1900±n/a nM
Citation
 Harris, CMEricsson, AMArgiriadi, MABarberis, CBorhani, DWBurchat, ACalderwood, DJCunha, GADixon, RWFrank, KEJohnson, EFKamens, JKwak, SLi, BMullen, KDPerron, DCWang, LWishart, NWu, XZhang, XZmetra, TRTalanian, RV 2,4-Diaminopyrimidine MK2 inhibitors. Part II: Structure-based inhibitor optimization. Bioorg Med Chem Lett 20:334-7 (2010)  
Target
Name:
MAP kinase-activated protein kinase 2
Synonyms:
MAP kinase-activated protein kinase 2 (MAPKAPK2) MAP kinase-activated protein kinase 2 (p38/MK2) MAPK-activated protein kinase 2 MAPKAP kinase 2 MAPKAPK2 | MK2
Type:
Serine/threonine-protein kinase
Mol. Mass.:
45579.87
Organism:
Homo sapiens (Human)
Description:
P49137
Residue:
400
  
Inhibitor
Name:
BDBM50305005
Synonyms:
7-(1H-indazol-5-yl)-5-methyl-5H-pyrrolo[3,2-d]pyrimidin-2-amine | CHEMBL589853
Type:
Small organic molecule
Emp. Form.:
C14H12N6
Mol. Mass.:
264.2853
SMILES:
Cn1cc(-c2ccc3[nH]ncc3c2)c2nc(N)ncc12
: