Target
Serine/threonine-protein kinase PLK4
Ligand
BDBM50305006
Substrate
Meas. Tech.
ChEMBL_606922 (CHEMBL1072665)
IC50
380±n/a nM
Citation
 Harris, CMEricsson, AMArgiriadi, MABarberis, CBorhani, DWBurchat, ACalderwood, DJCunha, GADixon, RWFrank, KEJohnson, EFKamens, JKwak, SLi, BMullen, KDPerron, DCWang, LWishart, NWu, XZhang, XZmetra, TRTalanian, RV 2,4-Diaminopyrimidine MK2 inhibitors. Part II: Structure-based inhibitor optimization. Bioorg Med Chem Lett 20:334-7 (2010)  
Target
Name:
Serine/threonine-protein kinase PLK4
Synonyms:
PLK4 Polo-Like Kinase 4 STK18 | Serine/threonine-protein kinase PLK4
Type:
PROTEIN
Mol. Mass.:
108996.91
Organism:
Homo sapiens (Human)
Description:
ChEMBL_1474078
Residue:
970
  
Inhibitor
Name:
BDBM50305006
Synonyms:
5-(2-aminoethyl)-7-(7-(benzo[b]thiophen-2-yl)-1H-indazol-5-yl)-5H-pyrrolo[3,2-d]pyrimidin-2-amine | CHEMBL590109
Type:
Small organic molecule
Emp. Form.:
C23H19N7S
Mol. Mass.:
425.509
SMILES:
NCCn1cc(-c2cc(-c3cc4ccccc4s3)c3[nH]ncc3c2)c2nc(N)ncc12
: