Target
Metabotropic glutamate receptor 5
Ligand
BDBM50305049
Substrate
Meas. Tech.
ChEMBL_602838 (CHEMBL1065282)
IC50
110±n/a nM
Citation
 Spanka, CGlatthar, RDesrayaud, SFendt, MOrain, DTroxler, TVranesic, I Piperidyl amides as novel, potent and orally active mGlu5 receptor antagonists with anxiolytic-like activity. Bioorg Med Chem Lett 20:184-8 (2010)  
Target
Name:
Metabotropic glutamate receptor 5
Synonyms:
GPRC1E GRM5_HUMAN metabotropic glutamate 5 | metabotropic glutamate 5a
Type:
Enzyme
Mol. Mass.:
132484.72
Organism:
Homo sapiens (Human)
Description:
Residue:
1212
  
Inhibitor
Name:
BDBM50305049
Synonyms:
(S)-(5-chloro-6-(6-methylpyridin-3-ylamino)pyridin-3-yl)(3-ethylpiperidin-1-yl)methanone | CHEMBL595712
Type:
Small organic molecule
Emp. Form.:
C19H23ClN4O
Mol. Mass.:
358.865
SMILES:
CC[C@H]1CCCN(C1)C(=O)c1cnc(Nc2ccc(C)nc2)c(Cl)c1
: