Target
Metabotropic glutamate receptor 5
Ligand
BDBM50305022
Substrate
Meas. Tech.
ChEMBL_602837 (CHEMBL1065281)
IC50
430±n/a nM
Citation
 Spanka, CGlatthar, RDesrayaud, SFendt, MOrain, DTroxler, TVranesic, I Piperidyl amides as novel, potent and orally active mGlu5 receptor antagonists with anxiolytic-like activity. Bioorg Med Chem Lett 20:184-8 (2010)  
Target
Name:
Metabotropic glutamate receptor 5
Synonyms:
GPRC1E GRM5_HUMAN metabotropic glutamate 5 | metabotropic glutamate 5a
Type:
Enzyme
Mol. Mass.:
132484.72
Organism:
Homo sapiens (Human)
Description:
Residue:
1212
  
Inhibitor
Name:
BDBM50305022
Synonyms:
CHEMBL594081 | rac-(6-(4-chlorophenylamino)pyridin-3-yl)(2-methylpiperidin-1-yl)methanone
Type:
Small organic molecule
Emp. Form.:
C18H20ClN3O
Mol. Mass.:
329.824
SMILES:
CC1CCCCN1C(=O)c1ccc(Nc2ccc(Cl)cc2)nc1
: