Target
Metabotropic glutamate receptor 5
Ligand
BDBM50305025
Substrate
Meas. Tech.
ChEMBL_602837 (CHEMBL1065281)
IC50
>10000±n/a nM
Citation
 Spanka, CGlatthar, RDesrayaud, SFendt, MOrain, DTroxler, TVranesic, I Piperidyl amides as novel, potent and orally active mGlu5 receptor antagonists with anxiolytic-like activity. Bioorg Med Chem Lett 20:184-8 (2010)  
Target
Name:
Metabotropic glutamate receptor 5
Synonyms:
GPRC1E GRM5_HUMAN metabotropic glutamate 5 | metabotropic glutamate 5a
Type:
Enzyme
Mol. Mass.:
132484.72
Organism:
Homo sapiens (Human)
Description:
Residue:
1212
  
Inhibitor
Name:
BDBM50305025
Synonyms:
6-(4-chlorophenylamino)-N-cyclohexylnicotinamide | CHEMBL594779
Type:
Small organic molecule
Emp. Form.:
C18H20ClN3O
Mol. Mass.:
329.824
SMILES:
Clc1ccc(Nc2ccc(cn2)C(=O)NC2CCCCC2)cc1
: