Target
Metabotropic glutamate receptor 2
Ligand
BDBM50305056
Substrate
Meas. Tech.
ChEMBL_603011 (CHEMBL1045614)
IC50
>10000±n/a nM
Citation
 Spanka, CGlatthar, RDesrayaud, SFendt, MOrain, DTroxler, TVranesic, I Piperidyl amides as novel, potent and orally active mGlu5 receptor antagonists with anxiolytic-like activity. Bioorg Med Chem Lett 20:184-8 (2010)  
Target
Name:
Metabotropic glutamate receptor 2
Synonyms:
GPRC1B GRM2_HUMAN Metabotropic glutamate receptor mGlu2 | metabotropic glutamate 2
Type:
Enzyme
Mol. Mass.:
95584.88
Organism:
Homo sapiens (Human)
Description:
Q14416
Residue:
872
  
Inhibitor
Name:
BDBM50305056
Synonyms:
(R)-(5-chloro-6-(6-methylpyridin-3-ylamino)pyridin-3-yl)(2-ethylpiperidin-1-yl)methanone | CHEMBL593590
Type:
Small organic molecule
Emp. Form.:
C19H23ClN4O
Mol. Mass.:
358.865
SMILES:
CC[C@@H]1CCCCN1C(=O)c1cnc(Nc2ccc(C)nc2)c(Cl)c1
: