Target
Broad substrate specificity ATP-binding cassette transporter ABCG2
Ligand
BDBM50423645
Substrate
Meas. Tech.
ChEMBL_603046 (CHEMBL1047707)
IC50
104000±n/a nM
Citation
 Pick, AMüller, HWiese, M Novel lead for potent inhibitors of breast cancer resistance protein (BCRP). Bioorg Med Chem Lett 20:180-3 (2010)  
Target
Name:
Broad substrate specificity ATP-binding cassette transporter ABCG2
Synonyms:
ABCG2 ABCP ATP-binding cassette sub-family G member 2 ATP-binding cassette, sub-family G, member 2 BCRP1 CDw338 Mitoxantrone resistance-associated protein Urate exporter
Type:
Multi-pass membrane protein; monomer or homodimer; disulfide-linked
Mol. Mass.:
72329.48
Organism:
Homo sapiens (Human)
Description:
Q9UNQ0
Residue:
655
  
Inhibitor
Name:
BDBM50423645
Synonyms:
Albamycin NOVOBIOCIN
Type:
Small organic molecule
Emp. Form.:
C31H36N2O11
Mol. Mass.:
612.6243
SMILES:
[#6]-[#8]-[#6@@H]1-[#6@@H](-[#8]-[#6](-[#7])=O)-[#6@H](-[#8])-[#6@@H](-[#8]-c2ccc3c(-[#8])c(-[#7]-[#6](=O)-c4ccc(-[#8])c(-[#6]\[#6]=[#6](\[#6])-[#6])c4)c(=O)oc3c2-[#6])-[#8]C1([#6])[#6]
: