Target
Tyrosine-protein kinase Lck
Ligand
BDBM50305139
Substrate
Meas. Tech.
ChEMBL_603253 (CHEMBL1049477)
IC50
0.550000±n/a nM
Citation
 Takayama, TUmemiya, HAmada, HYabuuchi, TKoami, TShiozawa, FOka, YTakaoka, AYamaguchi, AEndo, MSato, M Ring-fused pyrazole derivatives as potent inhibitors of lymphocyte-specific kinase (Lck): Structure, synthesis, and SAR. Bioorg Med Chem Lett 20:112-6 (2010)  
Target
Name:
Tyrosine-protein kinase Lck
Synonyms:
2.7.10.2 LCK_HUMAN Leukocyte C-terminal Src kinase Lymphocyte-specific protein tyrosine kinase Protein YT16 Proto-oncogene tyrosine-protein kinase LCK T cell-specific protein-tyrosine kinase
Type:
Mol. Mass.:
57987.83
Organism:
Homo sapiens (Human)
Description:
P06239
Residue:
509
  
Inhibitor
Name:
BDBM50305139
Synonyms:
6-(2-(4-methylpiperazin-1-yl)ethoxy)-2-(4-phenoxyphenyl)-9,10-dihydro-4H-benzo[d]pyrazolo[1,5-a][1,3]diazepine-3-carboxamide | CHEMBL592262
Type:
Small organic molecule
Emp. Form.:
C31H34N6O3
Mol. Mass.:
538.6401
SMILES:
CN1CCN(CCOc2ccc3CCn4nc(c(C(N)=O)c4Nc3c2)-c2ccc(Oc3ccccc3)cc2)CC1
: