Target
Renin
Ligand
BDBM29949
Substrate
Meas. Tech.
ChEMBL_603747 (CHEMBL1039372)
IC50
0.47±n/a nM
Citation
 Xu, ZCacatian, SYuan, JSimpson, RDJia, LZhao, WTice, CMFlaherty, PTGuo, JIshchenko, ASingh, SBWu, ZMcKeever, BMScott, BBBukhtiyarov, YBerbaum, JMason, JPanemangalore, RCappiello, MGBentley, RDoe, CPHarrison, RKMcGeehan, GMDillard, LWBaldwin, JJClaremon, DA Optimization of orally bioavailable alkyl amine renin inhibitors. Bioorg Med Chem Lett 20:694-9 (2010)  
Target
Name:
Renin
Synonyms:
Angiotensinogenase RENI_HUMAN
Type:
Enzyme
Mol. Mass.:
45058.99
Organism:
Homo sapiens (Human)
Description:
Residue:
406
  
Inhibitor
Name:
BDBM29949
Synonyms:
piperidine-1-carboxamide, 21l
Type:
Small organic molecule
Emp. Form.:
C28H46ClN3O3
Mol. Mass.:
508.136
SMILES:
[H][C@]1(CCCN(C1)C(=O)N[C@H](CNC)CC1CCCCC1)[C@@](O)(CCCCOC)c1cccc(Cl)c1
: